Wordpress failed create directory jobs

Filter

My recent searches
Filter by:
Budget
to
to
to
Skills
Languages
    Job State
    425 wordpress failed create directory jobs found, pricing in USD

    You can see the error here: [login to view URL] Site uses Yii, PHP and Mysql

    $24 (Avg Bid)
    $24 Avg Bid
    14 bids

    import via plesk Job for [login to view URL] failed because the control process exited with error code. See "systemctl status [login to view URL]" and "journalctl -xe" for details. Unable to import the database_new dump: ERROR 1062 (23000) at line 12478: Duplicate entry 'i breeze 500 [0,127970,129113] -> [N] POST [login to view URL]' for key 'SEARCH_QU...

    $52 (Avg Bid)
    $52 Avg Bid
    15 bids

    import via plesk Job for [login to view URL] failed because the control process exited with error code. See "systemctl status [login to view URL]" and "journalctl -xe" for details. Unable to import the database_new dump: ERROR 1062 (23000) at line 12478: Duplicate entry 'i breeze 500 [0,127970,129113] -> [N] POST [login to view URL]' for key 'SEARCH_QU...

    $30 (Avg Bid)
    $30 Avg Bid
    4 bids

    [login to view URL] is getting a "secure connection failed" error for some browsers: see: [login to view URL]://[login to view URL] I need help to fix this issue.

    $98 (Avg Bid)
    $98 Avg Bid
    41 bids

    Only need fixe for gradle 4.4 synchronization . and build apps complete show on ui . just fixed it . if you are experience on it it just less than 20 mins . thank you

    $20 / hr (Avg Bid)
    $20 / hr Avg Bid
    11 bids

    Hey! Can someone help me with this error? I am not able to start my react-native app. Android studio shows this error: "Failed to resolve: react-native" If I start the react-native app with the console, the error "Execution failed for task ':app:processDebugResources'." appears.

    $6 / hr (Avg Bid)
    $6 / hr Avg Bid
    21 bids

    Error: /project/gradlew: Command failed with exit code 1 Error output: FAILURE: Build failed with an exception. A problem occurred configuring root project 'project'. Here is the exact error: Could not find [login to view URL] ([login to view URL]:play-services-auth-base-license:11.8.0). Searched in the following locations with

    $16 / hr (Avg Bid)
    $16 / hr Avg Bid
    5 bids

    fix failed disk in FreeNas . .. freenas error down

    $463 (Avg Bid)
    $463 Avg Bid
    17 bids

    I need someone to configure my email server. It must be very simple but I do not know how to do it. Currently I get this error "550-No Such User Here 550 Sender verify failed" When I send an email from my server to hotmail, it bounces me; when I send to another domain I also reboot it, and gmail receives it but fails to identify the sender. And from

    $26 (Avg Bid)
    $26 Avg Bid
    9 bids

    here's the error - I need you to fox this. I would but I do not have time - this is no more than 1 hour - do not bid if you think it will take more time because if you do you're unqualified to do the work. What would you like to do? ------------------------------------------------------------------------------- 1: Attempt to reinstall this existing certificate 2: Renew & replace the ...

    $26 (Avg Bid)
    $26 Avg Bid
    6 bids

    I have attached a detail document here. It's a simple game work. I worked this with an indian team. But they were full of cheaters. He took my money and gave so bad works. I dont' want to fail again. He still not feeling about their fault at all. So I want you guys to make a bad review on their company first. Then I will be able to discuss with you project. Don't regard my price her...

    $1074 (Avg Bid)
    $1074 Avg Bid
    27 bids

    ...paid-then the site name that is freelancer, so in your test if your name is Moses save it this way. Moses_$8_Freelancer (this is part of the test so dont ignore) If you applied and failed please dont apply again. We only want serious people for long term cooperation, and please dont repost our post we will report you. And also we dont want our work to be seen

    $26 (Avg Bid)
    $26 Avg Bid
    8 bids

    I am looking for advanced proofreaders who can also track changes, I have attached an example and also the test in the file section below. Our rates are strictly 8-12$ per 1000 words. Please send your saved test results in the format eg. moffat_12$_freelancer. Meaning name_your rate in USD_platform. Kindly bid if you are serious, find the attached test do it and send. Start with the word "fin...

    $11 / hr (Avg Bid)
    $11 / hr Avg Bid
    21 bids

    After noting that divorce rate in America is almost 40% i decided to write a kindle book and publish it on Amazon. I am a third year psychology student so I have some advice to add to this book and I also have specific books to cite ( e.g evolutionary psychology)

    $48 (Avg Bid)
    $48 Avg Bid
    14 bids
    joomla update failed Ended
    VERIFIED

    Hi I have tried to upgrade my joomla to current version unfortunatelly it has failed. I need someone to repair and update to lates joomla version.

    $27 (Avg Bid)
    $27 Avg Bid
    20 bids

    After the installation of the SSL Certificate I'm receiving an error: SSL operation failed with code 1. OpenSSL Error messages:nerror:14090086:SSL routines:SSL3_GET_SERVER_CERTIFICATE:certificate verify failed in and I need to sort it out. I have tried different options to solve it myself but it's still not working. The website's SSL is working

    $62 (Avg Bid)
    $62 Avg Bid
    29 bids

    I'm working on a test case where I'm trying to test async action creator for a failed response. But the error is a promise and when the unit test is running the error promise is not resolving and the test is failing. eg: // [login to view URL] export const fetchData = () => { return (dispatch) => { return fetchJSON(URL).then((data) => {

    $10 - $30
    $10 - $30
    0 bids

    fix asap issue with our email not delivered "550 Reverse DNS lookup failed for IP...."

    $22 (Avg Bid)
    $22 Avg Bid
    16 bids

    ...paid-then the site name that is freelancer, so in your test if your name is Moses save it this way. Moses_$8_Freelancer (this is part of the test so dont ignore) If you applied and failed please dont apply again. We only want serious people for long term cooperation, and please dont repost our post we will report you. And also we dont want our work to be seen

    $20 / hr (Avg Bid)
    Featured
    $20 / hr Avg Bid
    10 bids

    just comment me 55 if you understant what i want. im geting 'failed to open stream: No such file or directory' error when i use copy(); it will take 1 min for solwe ofcouse if you know. i think its php 7.2 problem its working in old versions. source file is in attach. required: file will work on my host.

    $22 (Avg Bid)
    $22 Avg Bid
    24 bids

    SSL IS ALREADY INSTALLED AND HTTPS WORKING PROPERLY. What we need is to configure script and apache to connect login services with facebook or googleplus: [login to view URL] and [login to view URL] work can be done within ssh, only teamviewer or anydesktop . check: [login to view URL] chech attached photos. trasncript error shwon: 401. That’s an error. Error: inv...

    $12 / hr (Avg Bid)
    $12 / hr Avg Bid
    23 bids

    I need you to develop some software for me. I would like this software to be developed using PHP.

    $23 (Avg Bid)
    $23 Avg Bid
    1 bids

    Fix server issues. We are using vultr and since few hours it’s been giving a httpd failed error. Will need someone who is familiar with management of servers to fix this asap. Thanks!

    $35 (Avg Bid)
    $35 Avg Bid
    17 bids

    I try to build an app from source there is very popular. However in the building process its fail on one command. I searched on internet to find solutions. There is some, but i can't figure out to solved it. Need and meteor framework expert. The App Dependencies: NodeJS, Meteor, Yarn, Electron, Gulp

    $21 (Avg Bid)
    $21 Avg Bid
    3 bids

    Hi, I am working with google player services in unity3d 2017.3.1f1 on mac, whenever I import the package I got few errors, I am good in unity but not in Android native, so please bid only if you are an expert in Unity+Android, please start your bid with I can fix it on teamviewer , Before bidding you should look into the files carefully and let me know who can do it.

    $26 (Avg Bid)
    $26 Avg Bid
    3 bids

    ...software to be developed for Windows using SQL. Need you to go through my SQL server 2008 install log and tell me why it won't instal, I get 2 error messages the first being failed to setup data base and the second being instance does not exist. Need this problem solved asap. Extra details are I'm trying to install M.U.T software and this is where it

    $25 (Avg Bid)
    $25 Avg Bid
    3 bids

    NO HOURLY BID. ON TEAM VIEWER ONLY. HI we are receiving error (32)Broken pipe: mod_fcgid: ap_pass_brigade failed in handle_request_ipc function our sql server is going mental with load. we have tried all the methods on google but nothing worked. need your help now. we are running apache, linux with centos and php version 5.7 the error

    $27 (Avg Bid)
    $27 Avg Bid
    6 bids

    The attached addresses have been rejected by both Google and Nominatim geocoding APIs. The addresses are real addresses and we need to get the most accurate lat/lng coordinate possible, using manual research online. This may require searching different websites to understand the history of each address. Many are brand-new streets, some are mispelled. Very often the site [login to view URL] has t...

    $175 (Avg Bid)
    $175 Avg Bid
    19 bids

    I need a php developer who can provide a very fast service on bug fixing at Ajax call. I have a fixed budget of around 25 USD, but if there is a guy who can do this in 5 minutes, will pay him bonus for sure. Write "I am a super php developer" on your proposal, else your bid will be hidden or removed.

    $24 (Avg Bid)
    $24 Avg Bid
    30 bids

    Hello there, I am running a website with high traffic, I've installed Varnish becouse of website speed, when it reaches 2,300 online, it gives me 503 (Backend fetch failed) Varnish cache error. Maybe there is Varnish installed incorrectly, or there is a script problam wich burns the server. I also had atack from China/Russia Ip's but I've blocked

    $134 (Avg Bid)
    $134 Avg Bid
    13 bids

    Solve this issue: [login to view URL]

    $36 / hr (Avg Bid)
    $36 / hr Avg Bid
    6 bids

    my server use cenos and suddenly its mysql server/services has failed and we need it back to work asap. pls bid only if you have the previous experience regarding this work.

    $66 (Avg Bid)
    $66 Avg Bid
    24 bids

    ...working properly. when trying to attach a file it does not attach and corrupts the file. also when trying to send email it gives this error SMTP Error (250): Authentication failed. we need this sorted urgently right now, also you have to work via teamviewer as we can not share our email logins etc. only bid what you are agree to work on, DO NOT

    $26 (Avg Bid)
    $26 Avg Bid
    4 bids

    When customers use Our Payment Platform and the transaction fails, an order is still genera... theres a fix for this here [login to view URL] and [login to view URL] and Regards

    $37 (Avg Bid)
    $37 Avg Bid
    21 bids

    To recover the data from the RAID-5 array.

    $151 (Avg Bid)
    $151 Avg Bid
    3 bids

    I get the following error when I try to run my project. You will ned log to my computer using TeamV...ExpendableLabel framework and removed it from the search path but I may have caused another problem Error i get : ld: framework not found -framework clang: error: linker command failed with exit code 1 (use -v to see invocation)

    $36 (Avg Bid)
    $36 Avg Bid
    9 bids

    Plesk update failed / Restore of Plesk, no files on server or databses to be affected by the restore of plesk.

    $128 (Avg Bid)
    $128 Avg Bid
    18 bids

    I have a Multisite Wordpress Domain for 1 client. He has asked me to create multisite network so we can create domain for each of the stores that buy from us so that they can have website with up to date inventory of fish, and be able to sell fish to their customers as if main company was invisible If you go to this website: [login to view URL]

    $8 / hr (Avg Bid)
    $8 / hr Avg Bid
    9 bids

    I have a Multisite Wordpress Domain for 1 client. He has asked me to create multisite network so we can create domain for each of the stores that buy from us so that they can have website with up to date inventory of fish, and be able to sell fish to their customers as if main company was invisible If you go to this website: [login to view URL]

    $8 / hr (Avg Bid)
    $8 / hr Avg Bid
    17 bids

    I have a Multisite Wordpress Domain for 1 client. He has asked me to create multisite network so we can create domain for each of the stores that buy from us so that they can have website with up to date inventory of fish, and be able to sell fish to their customers as if main company was invisible If you go to this website: [login to view URL]

    $9 / hr (Avg Bid)
    $9 / hr Avg Bid
    10 bids

    I have a Multisite Wordpress Domain for 1 client. He has asked me to create multisite network so we can create domain for each of the stores that buy from us so that they can have website with up to date inventory of fish, and be able to sell fish to their customers as if main company was invisible If you go to this website: [login to view URL]

    $7 / hr (Avg Bid)
    $7 / hr Avg Bid
    6 bids

    ...to add 1 fish to cart. You will see the fish doesn't add, BUT then reload page, and you will see the fish in your cart. Error that is happening is: Uncaught DOMException: Failed to set the 'domain' property on 'Document': '[login to view URL]' is not a suffix of '[login to view URL]'. at [login to view URL]:1237:49

    $9 / hr (Avg Bid)
    $9 / hr Avg Bid
    6 bids

    ...to add 1 fish to cart. You will see the fish doesn't add, BUT then reload page, and you will see the fish in your cart. Error that is happening is: Uncaught DOMException: Failed to set the 'domain' property on 'Document': '[login to view URL]' is not a suffix of '[login to view URL]'. at [login to view URL]:1237:49

    $8 / hr (Avg Bid)
    $8 / hr Avg Bid
    6 bids

    ...to add 1 fish to cart. You will see the fish doesn't add, BUT then reload page, and you will see the fish in your cart. Error that is happening is: Uncaught DOMException: Failed to set the 'domain' property on 'Document': '[login to view URL]' is not a suffix of '[login to view URL]'. at [login to view URL]:1237:49

    $9 / hr (Avg Bid)
    $9 / hr Avg Bid
    5 bids

    ...to add 1 fish to cart. You will see the fish doesn't add, BUT then reload page, and you will see the fish in your cart. Error that is happening is: Uncaught DOMException: Failed to set the 'domain' property on 'Document': '[login to view URL]' is not a suffix of '[login to view URL]'. at [login to view URL]:1237:49

    $8 / hr (Avg Bid)
    $8 / hr Avg Bid
    7 bids

    ...to add 1 fish to cart. You will see the fish doesn't add, BUT then reload page, and you will see the fish in your cart. Error that is happening is: Uncaught DOMException: Failed to set the 'domain' property on 'Document': '[login to view URL]' is not a suffix of '[login to view URL]'. at [login to view URL]:1237:49

    $8 / hr (Avg Bid)
    $8 / hr Avg Bid
    5 bids

    I'm trying to install my theme and the required plug ins. However, this keeps failing because it says "Installation failed: Could not create directory" I need a professional who knows how to resolve this problem

    $23 (Avg Bid)
    $23 Avg Bid
    37 bids

    i am having issue with my file manager on webmin HTTP/1.0 500 Perl execution failed Server: MiniServ/1.860 Date: Tue, 28 Nov 2017 17:47:32 GMT Content-type: text/html; Charset=iso-8859-1 Connection: close

    $23 (Avg Bid)
    $23 Avg Bid
    5 bids

    I have a server from ovh on which i installed Ubuntu 14.04 and i want to install Ajenti (v) on it. But, NGINX service failed error came [login to view URL] . I need someone who can fix.

    $27 (Avg Bid)
    $27 Avg Bid
    5 bids

    Using CentOS/NGINX for wordpress within Joomla. Need to resolve permissions issue. When attempting to upload media files to wordpress we receive the following error: [login to view URL] has failed to upload. Unable to create directory wp-content/uploads/2017/11. Is its parent directory writable by the server? I've set all directories to 777, set n...

    $80 (Avg Bid)
    $80 Avg Bid
    17 bids